{"text_format":"1","workbook":"xlsx","n_sheets":13,"sheets":["APLICATIU","Xarxa pluviòmetres","Esquema cloració","Esquema UV","Dades meteorològiques","Aigua recollida","Pluviometres_CAT","Balanç anual","Consum","Necessitats de reg","Tarifes","Pressupost","Formularis"],"not_rendered":{"charts":0,"images":28,"macros":1,"external_links":0,"defined_names":0,"comments":0,"pivot_tables":0},"unopened":[],"bounds":{"document_bytes":16777216,"sheet_cells":100000,"rows_first":2000,"rows_last":500,"rows_between":2000,"halvings":0,"cell_chars":16384,"cell_head_chars":4096},"cells_cut":0,"cells_raw":0,"read":"whole","date_system":"1900"}

{"sheet":"APLICATIU","index":0,"n_rows":36,"n_cols":32,"rows_kept":36,"cut":false,"hidden":false,"merged":[[15,22,15,27],[16,22,18,25],[19,22,20,25],[24,22,25,25],[16,26,18,27],[19,26,20,27],[30,31,31,32],[30,9,30,10],[29,26,30,27],[29,22,30,24],[31,22,32,24],[31,25,32,27],[27,22,28,23],[33,22,34,25],[33,26,34,27],[30,17,31,17],[32,14,32,16],[33,14,33,16],[21,22,23,25],[21,26,23,27],[24,26,25,27],[30,14,31,16],[27,14,27,15],[24,14,24,15],[23,14,23,15],[21,14,22,15],[28,14,29,14],[25,16,26,16],[27,26,28,27],[34,7,34,8],[34,9,34,11],[23,7,23,11],[24,7,24,11],[25,7,25,11],[33,9,33,10],[32,9,32,10],[27,9,27,10],[28,9,28,10],[29,9,29,10],[32,7,32,8],[33,7,33,8],[2,10,3,11],[16,7,17,10],[18,7,19,10],[21,1,22,1],[21,2,22,2],[21,3,22,3],[21,4,22,4],[21,5,22,5],[20,7,20,10],[15,7,15,10],[6,7,6,8],[7,7,7,8],[8,7,8,8],[6,9,6,10],[7,9,7,10],[8,9,8,10],[21,7,21,11],[2,7,3,7],[3,8,3,9],[1,21,1,28],[3,24,3,27],[4,24,4,27],[5,24,6,27],[9,24,11,27],[9,22,11,23],[7,22,8,23],[7,24,8,27],[34,1,34,2],[34,3,34,5],[1,14,1,18],[3,14,3,18],[10,15,11,15],[3,2,3,4],[15,2,15,4],[1,1,1,5],[32,1,32,2],[33,1,33,2],[17,2,18,2],[17,4,18,4],[32,3,32,5],[1,7,1,11],[33,3,33,5],[34,14,34,15],[4,14,4,15],[4,16,4,18],[20,17,20,18],[25,14,26,15],[20,14,20,16],[25,17,26,18],[23,17,24,17],[8,16,8,18],[11,16,11,18],[12,16,12,18],[13,16,13,18],[14,16,14,18],[23,18,24,18],[10,16,10,18],[12,14,15,14],[10,14,11,14],[9,16,9,18],[21,18,22,18],[21,17,22,17],[12,15,15,15],[18,14,18,18],[15,16,15,18],[19,15,19,16],[21,16,22,16]]}
[]
[null,"DEMANDA A COBRIR",null,null,null,null,null,"DISPONIBILITAT D'AIGUA",null,null,null,null,null,null,"DESINFECCIÓ",null,null,null,null,null,null,"ESTALVI D'AIGUA"]
[null,null,null,null,null,null,null,"PLUVIOMETRE",null,null,"Veure plànol pluviòmetres"]
[null,null,"DOMÈSTICA",null,null,null,null,null,"Sant Andreu",null,null,null,null,null,"DESINFECCIÓ AMB HIPOCLORIT"]
[null,null,null,"RESIDENTS",null,null,null,null,null,null,null,null,null,null,"Veure esquema de desinfecció amb hipoclorit",null,"Veure esquema de desinfecció per rajos UV",null,null,null,null,null,null,null,"DEMANDA "]
[null,null,null,2,null,null,null,null,null,null,null,null,null,null,null,"CAPACITAT",null,null,null,null,null,null,null,null,{"$f":"VLOOKUP(I4,'Balanç anual'!AN6:AS7,3,FALSE)+VLOOKUP(I4,'Balanç anual'!AN6:AS7,4,FALSE)","v":123.86507342465754}]
[null,null,null,"OCUPACIÓ MITJANA ANUAL",null,null,null,"PRECIPITACIÓ",null,"SUPERFÍCIE DE RECOLLIDA",null,null,null,null,null,{"$f":"D10/2","v":161}]
[null,null,null,1,null,null,null,{"$f":"IF(I4=\"Personalitzat\",'Dades meteorològiques'!O7,IF(J22=0,(VLOOKUP(I4,'Aigua recollida'!P6:Q23,2,FALSE)),APLICATIU!J22))","v":677},null,70,null,null,null,null,null,"litres",null,null,null,null,null,null,"ESTALVI D'AIGUA",null,"VOLUM D'AIGUA ESTALVIAT"]
[null,null,null,"CONSUM\nFins a",null,null,null,"mm/any",null,"m² coberta",null,null,null,null,"VOLUM ESCOLLIT",{"$f":"IF(AND(P7=0,P7=0),0,IF(AND(P7>0,P7<=43),43,IF(AND(P7>43,P7<=94),94,IF(AND(P7>94,P7<=190),190,IF(AND(P7>190,P7<=297),297,IF(AND(P7>297,P7<=486),486,IF(AND(P7>486,P7<=905),905,IF(AND(P7>905,P7<=1002),1002,IF(AND(P7>1002,P7<=1050),1050,IF(AND(P7>1050,P7<=100000000000),1050))))))))))","v":190}]
[null,null,null,{"$f":"IF(D12=0,Consum!C16*D6,D12)","v":322},null,null,null,null,null,null,null,null,null,null,"TEMPS DE CONTACTE (hores)",{"$f":"(P9/D10)*24","v":14.161490683229815},"CABAL DE RECIRCULACIÓ",null,null,null,null,null,{"$f":"IFERROR(Y10/Y6,\"-\")","v":0.36368605575809071},null,{"$f":"IFERROR(VLOOKUP(I4,'Balanç anual'!AN6:AS7,6,FALSE),\"-\")","v":45.048000000000002}]
{"$rows_left_out":27}
{"sheet":"Xarxa pluviòmetres","index":1,"n_rows":2,"n_cols":10,"rows_kept":2,"cut":false,"hidden":false,"merged":[[1,0,2,7],[1,9,2,10]]}
[]
["XARXA DE PLUVIÒMETRES DEL PARC DEL MONTNEGRE I CORREDOR",null,null,null,null,null,null,null,null,"Torna a l'aplicatiu"]

{"sheet":"Esquema cloració","index":2,"n_rows":2,"n_cols":7,"rows_kept":2,"cut":false,"hidden":false,"merged":[[1,0,3,5],[1,6,3,7]]}
[]
["ESQUEMA DEL SISTEMA D'APROFITAMENT D'AIGÜES PLUVIALS AMB DESINFECCIÓ PER CLORACIÓ",null,null,null,null,null,"Torna a l'aplicatiu"]

{"sheet":"Esquema UV","index":3,"n_rows":2,"n_cols":7,"rows_kept":2,"cut":false,"hidden":false,"merged":[[1,0,3,5],[1,6,3,7]]}
[]
["ESQUEMA DEL SISTEMA D'APROFITAMENT D'AIGÜES PLUVIALS AMB DESINFECCIÓ PER RAJOS UV",null,null,null,null,null,"Torna a l'aplicatiu"]

{"sheet":"Dades meteorològiques","index":4,"n_rows":11,"n_cols":15,"rows_kept":11,"cut":false,"hidden":false,"merged":[[1,1,2,7],[1,13,2,14]]}
[]
[null,"DADES METEOROLÒGIQUES",null,null,null,null,null,null,null,null,null,null,null,"Torna a l'aplicatiu"]
[]
[]
[null,"Dades de precipitació"]
[null,"Mes","Gener","Febrer","Març","Abril","Maig","Juny","Juliol","Agost","Setembre","Octubre","Novembre","Desembre","Total"]
[null,"Pluviometria (mm)",0,0,0,0,0,0,0,0,0,0,0,0,{"$f":"SUM(C7:N7)","v":0}]
[]
[null,"Dades d'evapotranspiració"]
[null,"Mes","Gener","Febrer","Març","Abril","Maig","Juny","Juliol","Agost","Setembre","Octubre","Novembre","Desembre","Total"]
{"$rows_left_out":2}
{"sheet":"Aigua recollida","index":5,"n_rows":213,"n_cols":19,"rows_kept":213,"cut":false,"hidden":true,"merged":[[1,5,1,6]]}
[]
["Superfície coberta",{"$f":"APLICATIU!J8","v":70},null,null,null,"Dies de període sec",null,30]
["Eficiència de recollida",0.8]
[]
[null,null,null,null,null,null,null,null,null,null,null,null,null,null,null,"PLUVIOMETRE","PLUVIOMETRIA (mm)","AIGUA RECOLLIDA (l/dia)","AIGUA RECOLLIDA (m³/any)"]
["Personalitzat",null,null,null,null,null,null,null,null,null,null,null,null,null,null,{"$f":"A13","v":"Sant Andreu"},{"$f":"N16","v":677},{"$f":"N18","v":103.86849315068493},{"$f":"N17","v":37.911999999999999}]
[null,31,28,31,30,31,30,31,31,30,31,30,31,365,null,{"$f":"A6","v":"Personalitzat"},{"$f":"N9","v":0},{"$f":"N11","v":0},{"$f":"N10","v":0}]
["Mes","Gener","Febrer","Març","Abril","Maig","Juny","Juliol","Agost","Setembre","Octubre","Novembre","Desembre","Total"]
["Pluviometria (mm)",{"$f":"'Dades meteorològiques'!C7","v":0},{"$f":"'Dades meteorològiques'!D7","v":0},{"$f":"'Dades meteorològiques'!E7","v":0},{"$f":"'Dades meteorològiques'!F7","v":0},{"$f":"'Dades meteorològiques'!G7","v":0},{"$f":"'Dades meteorològiques'!H7","v":0},{"$f":"'Dades meteorològiques'!I7","v":0},{"$f":"'Dades meteorològiques'!J7","v":0},{"$f":"'Dades meteorològiques'!K7","v":0},{"$f":"'Dades meteorològiques'!L7","v":0},{"$f":"'Dades meteorològiques'!M7","v":0},{"$f":"'Dades meteorològiques'!N7","v":0},{"$f":"SUM(B9:M9)","v":0}]
["Aigua recollida (m³)",{"$f":"B9*$B$2*$B$3/1000","v":0},{"$f":"C9*$B$2*$B$3/1000","v":0},0,0,0,0,0,0,0,0,0,0,{"$f":"SUM(B10:M10)","v":0}]
{"$rows_left_out":204}
{"sheet":"Pluviometres_CAT","index":6,"n_rows":184,"n_cols":17,"rows_kept":184,"cut":false,"hidden":true,"merged":[]}
["COMARCA","CODI","Població","Nom per llista","GEN","FEB","MAR","ABR","MAi","JUN","JUL","AGO","SET","OCT","NOV","DES","ANY"]
["AltCamp","VY","Nulles","AltCamp_VY_Nulles",16.7,85.6,32.6,80.5,35.700000000000003,22.2,2.5,42.2,37.1,220.5,48.3,7.7,631.6]
["AltCamp","DQ","Vila-rodona","AltCamp_DQ_Vila-rodona",23.5,72.2,45.2,90.4,81.099999999999994,40.4,4.2,41.8,38.4,198.3,51.8,6.5,693.8]
["Alt Emporda","U1","Cabanes","Alt Emporda_U1_Cabanes",24.4,67.7,41.6,132.80000000000001,54.7,56,11.9,18.100000000000001,25.8,251.7,162,18.2,864.9]
["Alt Emporda","W1","Castelló d'Empúries","Alt Emporda_W1_Castelló d'Empúries",19.8,43.5,44.1,74.5,57.1,32.4,12.4,29.6,4.0999999999999996,202.2,125.9,12.7,658.3]
["Alt Emporda","vz","Espolia","Alt Emporda_vz_Espolia",53.6,46.5,41.9,109.8,82.1,59.7,21.4,31.6,17.7,190.4,177.4,15,847.1]
["Alt Emporda","Y5","Navata","Alt Emporda_Y5_Navata",38.9,87.1,31.9,128.9,110.5,97.3,35.1,22.8,36.4,209.1,265.5,15.1,1078.5999999999999]
["Alt Emporda","J5","Panta de Darnius - Boadella","Alt Emporda_J5_Panta de Darnius - Boadella",57,81.099999999999994,40.799999999999997,152.5,102.9,68.3,39.299999999999997,27.7,34.700000000000003,297.89999999999998,272.8,16.3,1191.3]
["Alt Emporda","D6","Portbou","Alt Emporda_D6_Portbou",17.7,58.7,68.900000000000006,75.599999999999994,24.1,28,40.200000000000003,60.8,24.2,231.8,64.5,29.8,724.3]
["Alt Emporda","D4","Roses","Alt Emporda_D4_Roses",21.8,44.3,48.9,63.3,33.1,25.2,22.4,70.7,2.2999999999999998,222.1,81.3,20.5,655.9]
{"$rows_left_out":175}
{"sheet":"Balanç anual","index":7,"n_rows":30,"n_cols":46,"rows_kept":30,"cut":false,"hidden":true,"merged":[]}
["Superfície coberta",{"$f":"APLICATIU!J8","v":70}]
["Eficiència de recollida",0.8,null,null,null,null,null,null,null,null,null,null,null,null,null,"Volum dipòsit (l)",{"$f":"APLICATIU!J29*1000","v":3800.0000000000005}]
[]
[{"$f":"'Aigua recollida'!A13","v":"Sant Andreu"},31,28,31,30,31,30,31,31,30,31,30,31,31,28,31,30,31,30,31,31,30,31,30,31,31,28,31,30,31,30,31,31,30,31,30,31]
["Mes","Gener","Febrer","Març","Abril","Maig","Juny","Juliol","Agost","Setembre","Octubre","Novembre","Desembre","Gener","Febrer","Març","Abril","Maig","Juny","Juliol","Agost","Setembre","Octubre","Novembre","Desembre","Gener","Febrer","Març","Abril","Maig","Juny","Juliol","Agost","Setembre","Octubre","Novembre","Desembre","TOTAL",null,"Pluviòmetre","Aigua recollida (m³/any)","Demanda domèstica (m³/any)","Demanda reg (m³/any)","Demanda total (m³/any)","Volum estalviat","Demanda reg (l/dia)"]
["Pluviometria (mm)",{"$f":"'Aigua recollida'!B16","v":58},{"$f":"'Aigua recollida'!C16","v":63},{"$f":"'Aigua recollida'!D16","v":56},{"$f":"'Aigua recollida'!E16","v":59},{"$f":"'Aigua recollida'!F16","v":54},{"$f":"'Aigua recollida'!G16","v":30},{"$f":"'Aigua recollida'!H16","v":20},{"$f":"'Aigua recollida'!I16","v":46},{"$f":"'Aigua recollida'!J16","v":86},{"$f":"'Aigua recollida'!K16","v":91},{"$f":"'Aigua recollida'!L16","v":56},{"$f":"'Aigua recollida'!M16","v":58},{"$f":"'Aigua recollida'!B16","v":58},{"$f":"'Aigua recollida'!C16","v":63},{"$f":"'Aigua recollida'!D16","v":56},{"$f":"'Aigua recollida'!E16","v":59},{"$f":"'Aigua recollida'!F16","v":54},{"$f":"'Aigua recollida'!G16","v":30},{"$f":"'Aigua recollida'!H16","v":20},{"$f":"'Aigua recollida'!I16","v":46},{"$f":"'Aigua recollida'!J16","v":86},{"$f":"'Aigua recollida'!K16","v":91},{"$f":"'Aigua recollida'!L16","v":56},{"$f":"'Aigua recollida'!M16","v":58},{"$f":"'Aigua recollida'!B16","v":58},{"$f":"'Aigua recollida'!C16","v":63},{"$f":"'Aigua recollida'!D16","v":56},{"$f":"'Aigua recollida'!E16","v":59},{"$f":"'Aigua recollida'!F16","v":54},{"$f":"'Aigua recollida'!G16","v":30},{"$f":"'Aigua recollida'!H16","v":20},{"$f":"'Aigua recollida'!I16","v":46},{"$f":"'Aigua recollida'!J16","v":86},{"$f":"'Aigua recollida'!K16","v":91},{"$f":"'Aigua recollida'!L16","v":56},{"$f":"'Aigua recollida'!M16","v":58},null,null,{"$f":"A4","v":"Sant Andreu"},{"$f":"AL7","v":1236.248},{"$f":"AL10","v":117.53},{"$f":"AL11","v":6.3350734246575335},{"$f":"AL12","v":123.86507342465754},{"$f":"AL15","v":45.048000000000002}]
["Aigua recollida (m³/mes)",{"$f":"'Aigua recollida'!B17","v":3.2480000000000002},{"$f":"'Aigua recollida'!C17","v":3.528},{"$f":"'Aigua recollida'!D17","v":3.1360000000000001},{"$f":"'Aigua recollida'!E17","v":3.3039999999999998},{"$f":"'Aigua recollida'!F17","v":3.024},{"$f":"'Aigua recollida'!G17","v":1.68},{"$f":"'Aigua recollida'!H17","v":1.1200000000000001},{"$f":"'Aigua recollida'!I17","v":2.5760000000000001},{"$f":"'Aigua recollida'!J17","v":4.8159999999999998},{"$f":"'Aigua recollida'!K17","v":5.0960000000000001},{"$f":"'Aigua recollida'!L17","v":3.1360000000000001},{"$f":"'Aigua recollida'!M17","v":3.2480000000000002},{"$f":"'Aigua recollida'!B17","v":3.2480000000000002},{"$f":"'Aigua recollida'!C17","v":3.528},{"$f":"'Aigua recollida'!D17","v":3.1360000000000001},{"$f":"'Aigua recollida'!E17","v":3.3039999999999998},{"$f":"'Aigua recollida'!F17","v":3.024},{"$f":"'Aigua recollida'!G17","v":1.68},{"$f":"'Aigua recollida'!H17","v":1.1200000000000001},{"$f":"'Aigua recollida'!I17","v":2.5760000000000001},{"$f":"'Aigua recollida'!J17","v":4.8159999999999998},{"$f":"'Aigua recollida'!K17","v":5.0960000000000001},{"$f":"'Aigua recollida'!L17","v":3.1360000000000001},{"$f":"'Aigua recollida'!M17","v":3.2480000000000002},{"$f":"'Aigua recollida'!B17","v":3.2480000000000002},{"$f":"'Aigua recollida'!D16","v":56},{"$f":"'Aigua recollida'!E16","v":59},{"$f":"'Aigua recollida'!F16","v":54},{"$f":"'Aigua recollida'!G16","v":30},{"$f":"'Aigua recollida'!H16","v":20},{"$f":"'Aigua recollida'!I16","v":46},{"$f":"'Aigua recollida'!J16","v":86},{"$f":"'Aigua recollida'!K16","v":91},{"$f":"'Aigua recollida'!L16","v":56},{"$f":"'Aigua recollida'!M16","v":58},{"$f":"'Aigua recollida'!N16","v":677},{"$f":"SUM(Z7:AK7)","v":1236.248},"m³/any","Personalitzat",{"$f":"AL22","v":0},{"$f":"AL25","v":117.53},{"$f":"AL26","v":6.3350734246575335},{"$f":"AL27","v":123.86507342465754},{"$f":"AL30","v":0}]
["Aigua recollida (l/mes)",{"$f":"B7*1000","v":3248},{"$f":"C7*1000","v":3528},3136,3304,3024,1680,1120,2576,4816,5096,3136,3248,3248,3528,3136,3304,3024,1680,1120,2576,4816,5096,3136,3248,3248,56000,59000,54000,30000,20000,46000,86000,91000,56000,58000,677000,null,null,null,null,"Aigua recollida",{"$f":"VLOOKUP(APLICATIU!I4,'Balanç anual'!AN6:AO7,2,FALSE)","v":1236.248}]
["Reserva d'aigua (l)",{"$f":"MIN(Q2,B8)","v":3248},{"$f":"MIN($Q$2,IF(B13<0,C8,IF(B13=0,B14+C8)))","v":3528},{"$f":"MIN($Q$2,IF(C13<0,D8,IF(C13=0,C14+D8)))","v":3136},3304,3024,1680,1120,{"$f":"MIN($Q$2,IF(H13<0,I8,IF(H13=0,H14+I8)))","v":2576},{"$f":"MIN($Q$2,IF(I13<0,J8,IF(I13=0,I14+J8)))","v":3800.0000000000005},{"$f":"MIN($Q$2,IF(J13<0,K8,IF(J13=0,J14+K8)))","v":3800.0000000000005},{"$f":"MIN($Q$2,IF(K13<0,L8,IF(K13=0,K14+L8)))","v":3136},{"$f":"MIN($Q$2,IF(L13<0,M8,IF(L13=0,L14+M8)))","v":3248},{"$f":"MIN($Q$2,IF(M13<0,N8,IF(M13=0,M14+N8)))","v":3248},3528,{"$f":"MIN($Q$2,IF(O13<0,P8,IF(O13=0,O14+P8)))","v":3136},{"$f":"MIN($Q$2,IF(P13<0,Q8,IF(P13=0,P14+Q8)))","v":3304},{"$f":"MIN($Q$2,IF(Q13<0,R8,IF(Q13=0,Q14+R8)))","v":3024},{"$f":"MIN($Q$2,IF(R13<0,S8,IF(R13=0,R14+S8)))","v":1680},{"$f":"MIN($Q$2,IF(S13<0,T8,IF(S13=0,S14+T8)))","v":1120},2576,{"$f":"MIN($Q$2,IF(U13<0,V8,IF(U13=0,U14+V8)))","v":3800.0000000000005},{"$f":"MIN($Q$2,IF(V13<0,W8,IF(V13=0,V14+W8)))","v":3800.0000000000005},{"$f":"MIN($Q$2,IF(W13<0,X8,IF(W13=0,W14+X8)))","v":3136},{"$f":"MIN($Q$2,IF(X13<0,Y8,IF(X13=0,X14+Y8)))","v":3248},{"$f":"MIN($Q$2,IF(Y13<0,Z8,IF(Y13=0,Y14+Z8)))","v":3248},3800.0000000000005,{"$f":"MIN($Q$2,IF(AA13<0,AB8,IF(AA13=0,AA14+AB8)))","v":3800.0000000000005},{"$f":"MIN($Q$2,IF(AB13<0,AC8,IF(AB13=0,AB14+AC8)))","v":3800.0000000000005},{"$f":"MIN($Q$2,IF(AC13<0,AD8,IF(AC13=0,AC14+AD8)))","v":3800.0000000000005},{"$f":"MIN($Q$2,IF(AD13<0,AE8,IF(AD13=0,AD14+AE8)))","v":3800.0000000000005},{"$f":"MIN($Q$2,IF(AE13<0,AF8,IF(AE13=0,AE14+AF8)))","v":3800.0000000000005},3800.0000000000005,{"$f":"MIN($Q$2,IF(AG13<0,AH8,IF(AG13=0,AG14+AH8)))","v":3800.0000000000005},{"$f":"MIN($Q$2,IF(AH13<0,AI8,IF(AH13=0,AH14+AI8)))","v":3800.0000000000005},{"$f":"MIN($Q$2,IF(AI13<0,AJ8,IF(AI13=0,AI14+AJ8)))","v":3800.0000000000005},{"$f":"MIN($Q$2,IF(AJ13<0,AK8,IF(AJ13=0,AJ14+AK8)))","v":3800.0000000000005},null,null,null,null,"Demanda total",{"$f":"VLOOKUP(APLICATIU!I4,'Balanç anual'!AN6:AR7,5,FALSE)","v":123.86507342465754}]
["Demanda domèstica (l/mes)",{"$f":"Consum!$C$19*B4","v":9982},{"$f":"Consum!$C$19*C4","v":9016},{"$f":"Consum!$C$19*D4","v":9982},{"$f":"Consum!$C$19*E4","v":9660},{"$f":"Consum!$C$19*F4","v":9982},{"$f":"Consum!$C$19*G4","v":9660},{"$f":"Consum!$C$19*H4","v":9982},{"$f":"Consum!$C$19*I4","v":9982},{"$f":"Consum!$C$19*J4","v":9660},{"$f":"Consum!$C$19*K4","v":9982},{"$f":"Consum!$C$19*L4","v":9660},{"$f":"Consum!$C$19*M4","v":9982},{"$f":"Consum!$C$19*N4","v":9982},{"$f":"Consum!$C$19*O4","v":9016},{"$f":"Consum!$C$19*P4","v":9982},{"$f":"Consum!$C$19*Q4","v":9660},{"$f":"Consum!$C$19*R4","v":9982},{"$f":"Consum!$C$19*S4","v":9660},{"$f":"Consum!$C$19*T4","v":9982},{"$f":"Consum!$C$19*U4","v":9982},{"$f":"Consum!$C$19*V4","v":9660},{"$f":"Consum!$C$19*W4","v":9982},{"$f":"Consum!$C$19*X4","v":9660},{"$f":"Consum!$C$19*Y4","v":9982},{"$f":"Consum!$C$19*Z4","v":9982},{"$f":"Consum!$C$19*AA4","v":9016},{"$f":"Consum!$C$19*AB4","v":9982},{"$f":"Consum!$C$19*AC4","v":9660},{"$f":"Consum!$C$19*AD4","v":9982},{"$f":"Consum!$C$19*AE4","v":9660},{"$f":"Consum!$C$19*AF4","v":9982},{"$f":"Consum!$C$19*AG4","v":9982},{"$f":"Consum!$C$19*AH4","v":9660},{"$f":"Consum!$C$19*AI4","v":9982},{"$f":"Consum!$C$19*AJ4","v":9660},{"$f":"Consum!$C$19*AK4","v":9982},{"$f":"(SUM(Z10:AK10)/1000)","v":117.53},"m³/any","RESERVA JULIOL"]
{"$rows_left_out":21}
{"sheet":"Consum","index":8,"n_rows":31,"n_cols":11,"rows_kept":31,"cut":false,"hidden":true,"merged":[]}
[]
[null,"Dotacions","lpd",null,null,"Consum instantani","l/s",null,null,"Dotació mitjana (l/m³/dia)",3]
[null,"Dutxa",{"$f":"IF(C11=0,43,19.35)","v":43},{"$f":"IF(Formularis!C3=TRUE(),1,0)","v":1},null,"Rentamans",0.05]
[null,"Inodor (WC)",{"$f":"IF(C12=0,27,0)","v":27},{"$f":"IF(Formularis!C4=TRUE(),1,0)","v":1},null,"Lavabo",0.1,{"$f":"APLICATIU!Q22","v":1},null,"Tipus de planta","Coef. cultiu"]
[null,"Lavabo",{"$f":"IF(C10=0,23,11.5)","v":23},{"$f":"IF(Formularis!C5=TRUE(),1,0)","v":1},null,"Dutxa",0.2,{"$f":"APLICATIU!Q24","v":0},null,"Plantes de zona àrida",0.3]
[null,"Aixetes",{"$f":"IF(C10=0,47,23.5)","v":47},{"$f":"IF(Formularis!C6=TRUE(),1,0)","v":1},null,"Banyera ≥ 1,40 m",0.3,{"$f":"APLICATIU!Q26","v":0},null,"Fruites",0.7]
[null,"Rentadora",16,{"$f":"IF(Formularis!C7=TRUE(),1,0)","v":1},null,"Banyera < 1,40 m",0.2,{"$f":"APLICATIU!Q25","v":0},null,"Arbres",0.8]
[null,"Cuina",5,{"$f":"IF(Formularis!C8=TRUE(),1,0)","v":1},null,"Bidet",0.1,{"$f":"APLICATIU!Q28","v":0},null,"Arbustos",0.8]
[null,"Rentavaixelles",7,{"$f":"IF(Formularis!C9=TRUE(),1,0)","v":0},null,"Inodor amb cisterna",0.1,{"$f":"APLICATIU!Q29","v":1},null,"Flors",1]
[null,"Airejadors",{"$f":"IF(Formularis!C11=TRUE(),1,0)","v":0},null,null,"Inodor amb fluxor",1.25,{"$f":"APLICATIU!Q30","v":0},null,"Gespa",1]
{"$rows_left_out":22}
{"sheet":"Necessitats de reg","index":9,"n_rows":77,"n_cols":19,"rows_kept":77,"cut":false,"hidden":true,"merged":[[15,18,16,18],[10,15,12,15],[15,15,16,15],[10,16,12,16],[10,17,12,17],[10,18,12,18],[15,16,16,16],[15,17,16,17]]}
[]
[null,31,28,31,30,31,30,31,31,30,31,30,31]
["Mes","Gener","Febrer","Març","Abril","Maig","Juny","Juliol","Agost","Setembre","Octubre ","Novembre","Desembre"]
["Eto mitjana (mm/mes)",29.68,39.97,66.98,84.35,110.4,132.93,147.02000000000001,135.16,94.56,62.55,35.97,26.67,null,null,"Sistema de reg","Eficiència"]
[null,null,null,null,null,null,null,null,null,null,null,null,null,null,null,"Mànega",0.65]
["Plantes zona àrida",null,null,null,null,null,null,null,null,null,null,null,null,null,null,"Aspersió",0.75]
["Coeficient cultiu",0.3,0.3,0.3,0.3,0.3,0.3,0.3,0.3,0.3,0.3,0.3,0.3,null,null,"Degoteig",0.8]
["Demanda de reg",{"$f":"B7*(IF('Dades meteorològiques'!C11=0,'Necessitats de reg'!B4,'Dades meteorològiques'!C11))","v":8.9039999999999999},{"$f":"C7*(IF('Dades meteorològiques'!D11=0,'Necessitats de reg'!C4,'Dades meteorològiques'!D11))","v":11.991},{"$f":"D7*(IF('Dades meteorològiques'!E11=0,'Necessitats de reg'!D4,'Dades meteorològiques'!E11))","v":20.094000000000001},{"$f":"E7*(IF('Dades meteorològiques'!F11=0,'Necessitats de reg'!E4,'Dades meteorològiques'!F11))","v":25.304999999999996},{"$f":"F7*(IF('Dades meteorològiques'!G11=0,'Necessitats de reg'!F4,'Dades meteorològiques'!G11))","v":33.119999999999997},{"$f":"G7*(IF('Dades meteorològiques'!H11=0,'Necessitats de reg'!G4,'Dades meteorològiques'!H11))","v":39.878999999999998},{"$f":"H7*(IF('Dades meteorològiques'!I11=0,'Necessitats de reg'!H4,'Dades meteorològiques'!I11))","v":44.106000000000002},{"$f":"I7*(IF('Dades meteorològiques'!J11=0,'Necessitats de reg'!I4,'Dades meteorològiques'!J11))","v":40.547999999999995},{"$f":"J7*(IF('Dades meteorològiques'!K11=0,'Necessitats de reg'!J4,'Dades meteorològiques'!K11))","v":28.367999999999999},{"$f":"K7*(IF('Dades meteorològiques'!L11=0,'Necessitats de reg'!K4,'Dades meteorològiques'!L11))","v":18.764999999999997},{"$f":"L7*(IF('Dades meteorològiques'!M11=0,'Necessitats de reg'!L4,'Dades meteorològiques'!M11))","v":10.790999999999999},{"$f":"M7*(IF('Dades meteorològiques'!N11=0,'Necessitats de reg'!M4,'Dades meteorològiques'!N11))","v":8.0009999999999994},null,null,0,0]
["Demanda de reg (l/mes)",{"$f":"APLICATIU!$E$18*B8","v":0},{"$f":"APLICATIU!$E$18*C8","v":0},{"$f":"APLICATIU!$E$18*D8","v":0},{"$f":"APLICATIU!$E$18*E8","v":0},{"$f":"APLICATIU!$E$18*F8","v":0},{"$f":"APLICATIU!$E$18*G8","v":0},{"$f":"APLICATIU!$E$18*H8","v":0},{"$f":"APLICATIU!$E$18*I8","v":0},{"$f":"APLICATIU!$E$18*J8","v":0},{"$f":"APLICATIU!$E$18*K8","v":0},{"$f":"APLICATIU!$E$18*L8","v":0},{"$f":"APLICATIU!$E$18*M8","v":0}]
["Demanda de reg (l/dia)",{"$f":"B9/B2","v":0},0,0,0,0,0,0,0,0,0,0,0,null,null,"Vegetació","Superfície (m²)","Sistema de reg ","Eficiència"]
{"$rows_left_out":68}
{"sheet":"Tarifes","index":10,"n_rows":32,"n_cols":27,"rows_kept":32,"cut":false,"hidden":true,"merged":[]}
[]
[null,"CANONADES PE40 PN10",null,null,"BAIXANTS PVC",null,null,"DIPÒSITS",null,null,"DIPÒSITS CLORACIÓ",null,null,null,null,null,null,"FILTRE",null,null,"GRUP PRESSIÓ"]
[null,"DN","Preu",null,"DN","Preu",null,"Volum","Preu",null,"Volum","Dipòsit","Tapa","Total","Caseta","Preu",null,"Superfície","Preu",null,"Pressió","Cabal","Potència","Preu"]
[null,20,1.77,{"$f":"IF(#REF!<=B4,1,0)","v":{"$error":"#REF!"}},75,4.7300000000000004,null,1.3,245,null,43,69.94,18.510000000000002,{"$f":"L4+M4","v":88.45},"1,28x1,96x0,94",249,null,80,25.5,null,34,4.2,0.65,358]
[null,25,2.7,{"$f":"IF(AND($H$21<=B5,$H$21>B4),1,0)","v":0},null,null,null,2.6,570,null,94,83.31,21.6,{"$f":"L5+M5","v":104.91},"1,28x1,96x0,94",249,null,160,{"$f":"S4+25.5","v":51},null,45,4.2,0.77,370.8]
[null,32,4.45,{"$f":"IF(AND($H$21<=B6,$H$21>B5),1,0)","v":0},"Coef. accessoris",0.5,null,3.2,755,null,190,159.41999999999999,26.74,186.16,"1,28x1,96x0,94",249,null,240,{"$f":"S5+25.5","v":76.5},null,58,4.2,1.01,392.7,null,"Cabal",{"$f":"APLICATIU!O33","v":1.6530710189124076}]
[null,40,6.9,0,null,null,null,3.9,825,null,297,171.76,31.88,203.64,"1,86x2,26x1,25",399,null,320,102,null,35,7.2,0.78,443,null,"Pressió",{"$f":"APLICATIU!R33","v":22.5}]
[null,50,10.66,0,null,null,null,4.8,1150,null,486,212.9,42.17,255.07,"1,86x2,26x1,25",399,null,400,127.5,null,47,7.2,1.07,448.4,null,"Cabal 4,20",{"$f":"IF(AND(AA6<=V4,AA7<=U4),X4,IF(AND(AA6<=V5,AA7<=U5),X5,IF(AND(AA6<=V6,AA7<=U6),X6,FALSE)))","v":358}]
[null,63,16.649999999999999,0,null,null,null,6.4,1540,null,905,338.38,48.34,386.72,"1,85x2,26x1,83",545,null,null,null,null,59,7.2,1.31,532.5,null,"Cabal 7,20",{"$f":"IF(AND(AA6<=V7,AA7<=U7),X7,IF(AND(AA6<=V8,AA7<=U8),X8,IF(AND(AA6<=V9,AA7<=U9),X9,FALSE)))","v":443}]
[null,75,23.85,0,null,null,null,9,2800,null,1002,370.26,48.34,418.6,"1,85x2,26x1,83",545,null,"Aixeta",10.199999999999999,null,null,null,null,null,null,"Cabal màxim",{"$f":"IF(AA6<=V4,V4,V7)","v":4.2}]
{"$rows_left_out":23}
{"sheet":"Pressupost","index":11,"n_rows":82,"n_cols":6,"rows_kept":82,"cut":false,"hidden":true,"merged":[]}
[]
[]
["RECOL·LECCIÓ I EMMAGATZEMATGE D'AIGÜES PLUVIALS"]
[]
[]
["Codi","Concepte","Preu unitari","Amidament","Import (sense IVA)"]
[1,"Dipòsit",{"$f":"VLOOKUP(F7,Tarifes!H4:I10,2,FALSE)","v":825},1,{"$f":"C7*D7","v":825},{"$f":"IF(AND(APLICATIU!J29>0,APLICATIU!J29<=1.3),1.3,IF(AND(APLICATIU!J29>1.3,APLICATIU!J29<=2.6),2.6,IF(AND(APLICATIU!J29>2.6,APLICATIU!J29<=3.2),3.2,IF(AND(APLICATIU!J29>3.2,APLICATIU!J29<=3.9),3.9,IF(AND(APLICATIU!J29>3.9,APLICATIU!J29<=4.8),4.8,IF(AND(APLICATIU!J29>4.8,APLICATIU!J29<=6.4),6.4,IF(AND(APLICATIU!J29>6.4,APLICATIU!J29<=9),9,IF(AND(APLICATIU!J29>9,APLICATIU!J29<=10000000),9))))))))","v":3.9}]
[2,"Filtre",{"$f":"VLOOKUP(F8,Tarifes!R4:S8,2,FALSE)","v":25.5},1,{"$f":"C8*D8","v":25.5},{"$f":"IF(AND(APLICATIU!J8>0,APLICATIU!J8<=80),80,IF(AND(APLICATIU!J8>80,APLICATIU!J8<=160),160,IF(AND(APLICATIU!J8>160,APLICATIU!J8<=240),240,IF(AND(APLICATIU!J8>240,APLICATIU!J8<=320),320,IF(AND(APLICATIU!J8>320,APLICATIU!J8<=400),400,FALSE)))))","v":80}]
[3,"Aixeta",{"$f":"Tarifes!S10","v":10.199999999999999},1,10.199999999999999]
[4,"Sobreeixidor d'emergència,",{"$f":"Tarifes!S12","v":2.4500000000000002},2,{"$f":"C10*D10","v":4.9000000000000004}]
{"$rows_left_out":73}
{"sheet":"Formularis","index":12,"n_rows":11,"n_cols":6,"rows_kept":11,"cut":false,"hidden":true,"merged":[]}
[]
[]
[null,"Dutxa",true,null,"DISPONIBILITAT"]
[null,"Inodor (WC)",true,null,"DEMANDA"]
[null,"Lavabo",true]
[null,"Aixetes",true]
[null,"Rentadora",true,null,"DESINFECCIÓ AMB HIPOCLORIT","CLORACIÓ"]
[null,"Cuina",true,null,"DESINFECCIÓ PER RAJOS UV","RAJOS UV"]
[null,"Rentavaixelles",false]
[null,null,null,null,"Cisterna"]
{"$rows_left_out":1}